{"text_format":"1","workbook":"xlsx","n_sheets":22,"sheets":["Developer& reviewer comments ","1. Workbook Overview","1.1 Background","1.2 Stakeholders","1.3 Informing NSP priorities ","1.4 Interventions","1.5 Work Tracker","2.1 Literature Review","2.2 Adaptation Calcs","2.3 IBC Unit costs","2.4 IBC Common Ingredients","2.4 Lump Sum","3.1 Unit Cost Table","3.2 Population Indicators","Dropdowns","3.3 NSP Total Costs","4.1 Efficiency","4.2 SA","4.2 Scenario Analysis","4.4 Equity Analysis","5.1 TRAC","5.2 Results Summary"],"not_rendered":{"charts":5,"images":1,"macros":1,"external_links":0,"defined_names":14,"comments":12,"pivot_tables":1},"unopened":[],"bounds":{"document_bytes":16777216,"sheet_cells":100000,"rows_first":2000,"rows_last":500,"rows_between":2000,"halvings":0,"cell_chars":16384,"cell_head_chars":4096},"cells_cut":0,"cells_raw":0,"read":"whole","date_system":"1900"}

{"sheet":"Developer& reviewer comments ","index":0,"n_rows":5,"n_cols":4,"rows_kept":5,"cut":false,"hidden":true,"merged":[]}
[]
[null,"Notes, questions, comments"]
[]
[2.1,"literature source: needs to include  models"]
[2.1,"NSP Program Area","NSP Interventions","not comprehensive enough and difficult to add categories"]

{"sheet":"1. Workbook Overview","index":1,"n_rows":25,"n_cols":7,"rows_kept":25,"cut":false,"hidden":false,"merged":[[19,1,21,1],[23,1,24,1],[15,1,17,1],[4,1,8,1],[10,1,12,1]]}
[]
[]
[null,"Section","Sheet #","Sheet Name",null,"Guideline Chapter","Purpose"]
[]
[null,"1. Preparatory Work",1.1000000000000001,"Background",null,"Chapter 3,11,12","Summarize costing purpose & overall methodology"]
[null,null,1.2,"Stakeholders",null,"Chapter 3 & 11","Maintain an inventory of all the stakeholders relevant to NSP costing process"]
[null,null,1.3,"NSP prioritisation",null,"Chapter 3  ","Collate CEA evidence and share key efficiency questions with NSP teams"]
[null,null,1.4,"Interventions",null,"Chapter 4","Collect and update information and details on each intervention that needs to be costed"]
[null,null,1.5,"Work Tracker",null,"Chapter 4","Track costing process, decisions, and methodology"]
[]
{"$rows_left_out":16}
{"sheet":"1.1 Background","index":2,"n_rows":63,"n_cols":11,"rows_kept":63,"cut":false,"hidden":false,"merged":[[19,2,19,3],[24,2,24,3],[6,3,6,6],[40,2,40,3],[43,2,43,3]]}
[]
[]
[null,null,"NSP COSTING BACKGROUND"]
[]
[]
[]
[null,null,"Instructions: ","Summarize costing purpose & overall methodology"]
[]
[null,null,"Relevant Guidelines Chapters:","Chapter 3 - Defining scope & purpose"]
[null,null,null,"Chapter 10 - Sensitivity and technical efficiency and budget impact analysis"]
{"$rows_left_out":54}
{"sheet":"1.2 Stakeholders","index":3,"n_rows":8,"n_cols":8,"rows_kept":8,"cut":false,"hidden":false,"merged":[[6,0,6,3],[6,4,6,5]]}
[]
[]
[null,null,"CHAPTER 3: COLLABORATION IN THE NSP PROCESS"]
[null,null,"Purpose of this tool: To keep track of all the different stakeholders, key informants, and their contacts throughout the NSP costing process. "]
[]
[]
["NSP Framework",null,null,null,"Contact Information",null,"Data Collection","Communication"]
["Name","Title/Job Function","NSP TWG/Team","NSP Role","Email","Phone","Information needed from individual","Frequency of communication needed"]

{"sheet":"1.3 Informing NSP priorities ","index":4,"n_rows":99,"n_cols":5,"rows_kept":99,"cut":false,"hidden":false,"merged":[[44,2,45,2],[44,3,45,3],[44,4,45,4],[39,2,41,2],[39,3,41,3],[39,4,41,4],[42,2,43,2],[42,3,43,3],[42,4,43,4],[61,2,62,2],[61,3,62,3],[61,4,62,4],[49,2,50,2],[49,3,50,3],[49,4,50,4],[52,2,53,2],[52,3,53,3],[52,4,53,4]]}
[]
[]
[null,"CHAPTER 3: COLLABORATION IN THE COSTING PROCESS"]
[]
[null,"Generating rapid cost-effectiveness evidence for priority setting"]
[]
[]
[null,"1. Template for sharing CEA evidence"]
[null,"Prevention","Evidence on cost","Evidence on cost per HIV infection averted","Source"]
[null,"FSW HIV prevention "]
{"$rows_left_out":90}
{"sheet":"1.4 Interventions","index":5,"n_rows":110,"n_cols":17,"rows_kept":110,"cut":false,"hidden":false,"merged":[[3,2,3,3],[10,14,10,16],[9,2,9,4],[10,6,10,7],[10,9,10,10],[10,12,10,13]]}
[]
[]
[null,null,"CHAPTER 5: REVIEWING INTERVENTIONS TO BE COSTED"]
[null,null,"Purpose of this tool: Collect baseline information on each intervention that needs to be included in the costing. Allows cost analysts to show their due diligence in aligning NSP with costing work, while collecting and documenting key information on each intervention to facilitate costing. "]
[null,null,"Red cells: required information"]
[null,null,"Blue cells: information to keep updated"]
[null,null,"Remaining cells: additional useful information"]
[]
[]
[]
{"$rows_left_out":101}
{"sheet":"1.5 Work Tracker","index":6,"n_rows":106,"n_cols":11,"rows_kept":106,"cut":false,"hidden":false,"merged":[[6,4,6,5],[6,6,6,7],[5,4,5,8],[5,9,5,10]]}
[]
[]
[null,null,null,"WORKPLAN/TRACKER"]
[]
[]
[null,null,null,null,"Preparation",null,null,null,null,"Work Tracker"]
[null,null,"Intervention #","Interventions","Include in Costing?",null,"Big-ticket item",null," Costing Method","Status","Notes on Status / Next Steps"]
[null,null,null,"List every intervention identified by the TWG","Is this intervention included in the costing?","If partially or no, justify","Is this a big-ticket item? See Chapter 6 for explanation of big-ticket items","Will you conduct a process map? Note that interventions indicated as big-ticket items should all have process maps done. See chapter 5 for more information on process maps","What methodological approach will you take to cost this intervention? See chapter 6 for more information on costing method. ",null," "]
[null,null,null,{"$f":"'1.4 Interventions'!C13","v":"Comprehensive HIV testing services - provider initiated"},null,null,null,null,null,"Not started"]
[null,null,null,{"$f":"'1.4 Interventions'!C14","v":"Medical male circumcision"},null,null,null,null,null,"Not started"]
{"$rows_left_out":97}
{"sheet":"2.1 Literature Review","index":7,"n_rows":95,"n_cols":40,"rows_kept":95,"cut":false,"hidden":false,"merged":[[8,1,8,2],[8,19,8,20],[8,31,8,33],[8,21,8,23],[8,24,8,28],[8,38,8,39],[8,3,8,8],[8,9,8,12],[3,3,4,11],[8,35,8,36]]}
[]
[]
[null,null,"CHAPTER 7: LITERATURE REVIEW"]
[null,null,"Objective: ","Document findings from literature search by filling in columns A:G. Indicate if source cost will be used in NSP costing. If so, continue filling informations in columns I:AI, to justify use of this source cost and identify areas that may need adapations. "]
[]
[null,null,"Grey text ","Auto-filled, does not require manual entry"]
[]
[]
[null,"NSP",null,"SOURCE",null,null,null,null,null,"UNIT COST",null,null,null,null,null,"INTEGRATED HEALTH TOOL INPUTS, if using IHT",null,null,null,"DATE CHECK",null,"GEOGRAPHY",null,null,"GEO CHECK",null,null,null,null,"POPULATION","POP CHECK","SOURCE METHODOLOGY",null,null,"METHOD CHECK","ACTIVITY SCOPE",null,"SCOPE MATCH","NOTES"]
[null,"NSP Program Area","NSP Interventions","Source Name","Source Link","Primary source?","Source Type","Source Intervention","Use source/unit cost in costing?","Unit Cost","Output Unit","Currency","Year","Today's Year","Data Age","staff time per visit in minutes","nr outpatient visits","cost of medical supplies","nr  inpatient days","Data Age","Need to adjust for inflation?","Country","Region","Country Income Level","NSP Country","NSP Region","NSP Country Income Level",null,"Geographic Suitability","Target Population Category","POP Suitability","Modeled vs. Observed","Financial vs. Economic","Full vs. Incremental","Does this meet cost need/purpose","Activity Scope","Delivery Platform(s)","Does this correspond to the NSP intervention?","Does this unit cost require adaptation?","Notes, explanation"]
{"$rows_left_out":86}
{"sheet":"2.2 Adaptation Calcs","index":8,"n_rows":39,"n_cols":10,"rows_kept":39,"cut":false,"hidden":false,"merged":[[14,7,15,7],[14,8,15,8],[14,9,15,9],[13,2,13,3],[14,1,15,1],[14,2,14,3],[14,4,15,4],[14,5,15,5],[14,6,15,6]]}
[]
[]
[null,"CHAPTER 7: COLLECTING AND ADAPTING UNIT COSTS"]
[]
[null,"The adaptation approach"]
[]
[]
[]
[null,"Adaptation Calculations for Previously Estimated Unit Costs"]
[null,"This is a template that should be copied and pasted, so that there is recipe for each intervention that is being costed by adapting previous estimates"]
{"$rows_left_out":30}
{"sheet":"2.3 IBC Unit costs","index":9,"n_rows":94,"n_cols":9,"rows_kept":94,"cut":false,"hidden":false,"merged":[[13,2,13,5],[39,2,39,5],[67,2,67,5]]}
[]
[]
[null,"CHAPTER 8: CONSTRUCTING UNIT COSTS FROM INGREDIENTS"]
[]
[null,"Ingredients based costing of interventions"]
[]
[]
[]
[null,"INGREDIENT BASED COSTING RECIPE NOTES"]
[null,"This is a template that should be copied and pasted, so that there is recipe for each intervention that is being costed by the IBC method"]
{"$rows_left_out":85}
{"sheet":"2.4 IBC Common Ingredients","index":10,"n_rows":34,"n_cols":7,"rows_kept":34,"cut":false,"hidden":false,"merged":[[8,1,8,5],[9,1,9,5]]}
[]
[]
[null,"CHAPTER 8: CONSTRUCTING UNIT COSTS FROM INGREDIENTS"]
[]
[null,"Common input prices"]
[]
[]
[]
[null,"List of common ingredients to reference in recipes"]
[null,"This table includes any common ingredients that the analyst wants to reference when building recipes"]
{"$rows_left_out":25}
{"sheet":"2.4 Lump Sum","index":11,"n_rows":15,"n_cols":7,"rows_kept":15,"cut":false,"hidden":true,"merged":[[11,2,11,5],[12,2,12,5],[13,2,13,5],[14,2,14,5],[6,2,6,5],[7,2,7,5],[8,2,8,5],[9,2,9,5],[10,2,10,5]]}
[]
[null,"INTERVENTIONS COSTED AS LUMP SUM"]
[null,"This table is for documentation of interventions being costed by lump sum"]
[]
[]
["Intervention Master List Line Number","Intervention Name","Description",null,null,null,"Lump Sum Amount"]
[1,{"$f":"VLOOKUP($A7,'1.4 Interventions'!$B$11:$C$110,5,0)","v":{"$error":"#REF!"}},"Implement age-appropriate life skills, behaviour change and empowerment activities through the peer education and youth club model, focusing on girls in and out of primary schools (8-14 Years).\n1 club per school. 25 participants be club.\nThis is regarded as a \"high norms & standards\" youth club for priority districts.\nAbove site management and overhead costs from a service provider perspective only",null,null,null,50000]
[null,{"$f":"VLOOKUP($A8,'1.4 Interventions'!$B$11:$C$110,5,0)","v":{"$error":"#N/A"}}]
[null,{"$f":"VLOOKUP($A9,'1.4 Interventions'!$B$11:$C$110,5,0)","v":{"$error":"#N/A"}}]
[null,{"$f":"VLOOKUP($A10,'1.4 Interventions'!$B$11:$C$110,5,0)","v":{"$error":"#N/A"}}]
{"$rows_left_out":6}
{"sheet":"3.1 Unit Cost Table","index":12,"n_rows":107,"n_cols":16,"rows_kept":107,"cut":false,"hidden":false,"merged":[]}
[]
[]
[null,"CHAPTER 9: BRINGING IT ALL TOGETHER - ESTIMATING TOTAL COSTS",null,null,null,null,null,null,null,null,null,null,null,null,null," "]
[]
[null,"Unit costs"]
[]
[]
[null,null,null,null,null,null,"Year-specific Unit Cost"]
["Line #","Unit definition","Source and Explanation","Costing Method","Unit Cost (Base Year)","Base Year",2025,{"$f":"G9+1","v":2026},{"$f":"H9+1","v":2027},{"$f":"I9+1","v":2028},{"$f":"J9+1","v":2029},{"$f":"K9+1","v":2030},"Notes on Year-specific adjustments"]
["Ex. 1","Average cost per person tested for HIV - PICT","SA HIV Investment Case. Assumes a 10% positivity rate","Ingredients",{"$f":"UCHIVTest","v":110.66155579328506},2024,{"$f":"E10","v":110.66155579328506},{"$f":"G10","v":110.66155579328506},{"$f":"H10","v":110.66155579328506},110.66155579328506,110.66155579328506,110.66155579328506]
{"$rows_left_out":98}
{"sheet":"3.2 Population Indicators","index":13,"n_rows":68,"n_cols":16,"rows_kept":68,"cut":false,"hidden":false,"merged":[]}
[]
[]
[null,"CHAPTER 9: BRINGING IT ALL TOGETHER - ESTIMATING TOTAL COSTS",null,null,null,null,null,null,null,null,null,null,null,null,null," "]
[]
[null,"Quantity Calculations"]
[]
[]
[null,null,null,"Year"]
[null,null,null,2025,{"$f":"D9+1","v":2026},{"$f":"E9+1","v":2027},2028,2029,2030]
[null,"Intervention ",{"$f":"'1.4 Interventions'!C13","v":"Comprehensive HIV testing services - provider initiated"}]
{"$rows_left_out":59}
{"sheet":"Dropdowns","index":14,"n_rows":35,"n_cols":29,"rows_kept":35,"cut":false,"hidden":false,"merged":[]}
["Program Area","Interventions","Target Populations","Implementer","Scale","New/Routine","Include in Costing?","If partially or no, specify ","Big ticket item","Process Map","Costing Method","Primary source?","Source Type","Modeled vs. Observed","Financia vs. Economic","Full vs. Incremental","Does this meet costing purpose?","Region","Country Income Level","Costing Perspective","Costing Aim","Projected inflation to future costs","Normative/Real-world","Source Type","Service-level human resources","Method for Estimation","Source Type","Modeling software","Progress Status"]
["Test & Treat","HIV Testing","N/A","Not specified/no information provided","National","Routine intervention, no adaptations","Yes","Not relevant to costing aims","Yes","Yes","Adapt existing unit cost","Yes","Published peer-reviewed","Modeled","Financial","Full","Yes","Asia and the Pacific ","Low-Income Country ","Provider","Full resource needs estimate of NSP interventions","Yes, annual inflation rate:","Normative costs",null,"Included in cost estimate","Unit cost adapted from literature","Budget",null,"Not started"]
["Paediatric Test & Treat","Early Infant Diagnosis","Not specified/no information provided","Public sector","Regional","Routine intervention, adaptations needed","Partially","Not relevant to costing provider perspective","No","No","Build unit cost from scratch","No","Grey Literature","Observed","Economic","Incremental","No","Eastern Europe and Central Asia","Lower-Middle-Income Country","Societal","Cost a list of prioritized interventions","No. Specify why:","Real world costs",null,"Included elsewhere","Unit cost modeled from ingredient based costing","Expenditure report",null,"In Progress"]
["Integrated Health Services","Paediatric treatment","General Population","Private sector, international, for profit","Targeted Sites","Piloted/recently implemented intervention, adaptations and/or scale-up needed","No","Not repevant to cost type",null,null,"Lumpsum",null,null,"Unsure","Unsure","Unsure","Unsure","Eastern and Southern Africa","Upper-Middle-Income Country",null,"Identifying resource needs gaps to realize NSP targets",null,null,null,"Excluded from NSP costing","Lump Sum","Key Informant Interview",null,"Complete"]
["Prevention Services","ART","Key and/or Vulnerable Populations","Private sector, national, for profit","Other","Novel intervention, no pilot or prior country implementation done",null,null,null,null,"Percentage of direct costs",null,null,null,null,null,null,"Latin America and the Caribbean","High-Income Country",null,"Other (please specify)",null,null,null,null,"%","Peer-reviewed study"]
["Societal Enablers","Laboratory","PLHIV","Private sector, international, non profit",null,null,null,null,null,null,"Other",null,null,null,null,null,null,"Middle East and North Africa",null,null,null,null,null,null,null,null,"Country modeled costing"]
["Support Functions","Retention Support","Adult Men (18 and above)","Private sector, national, non profit",null,null,null,null,null,null,null,null,null,null,null,null,null,"Western and Central Africa"]
[null,"Tuberculosis",null,"Private sector, community or civil society organizations, non profit",null,null,null,null,null,null,null,null,null,null,null,null,null,"Western and Central Europe and North America"]
[null,"Cervical Cancer",null,"Other"]
[null,"VMMC"]
{"$rows_left_out":26}
{"sheet":"3.3 NSP Total Costs","index":15,"n_rows":109,"n_cols":27,"rows_kept":109,"cut":false,"hidden":false,"merged":[]}
[]
[]
[null,"CHAPTER 9: BRINGING IT ALL TOGETHER - ESTIMATING TOTAL COSTS",null,null,null,null,null,null,null,null,null,null,null,null,null," "]
[]
[null,"Total costs"]
[]
[]
[null,null,"NSP Framework",null,null,null,"Intervention Scale (number of output units)",null,null,null,null,null,null,"Unit Cost",null,"Year-specific Unit Cost",null,null,null,null,null,"Annual Costs (Quantities x Prices)"]
["Intervention Master List Line Number","Intervention","NSP Objective","NSP Sub-Objective","Rollup Category","Costing Method","Intervention Output Unit Definition (Population)",{"$f":"StartYear","v":0},{"$f":"H9+1","v":1},{"$f":"I9+1","v":2},{"$f":"J9+1","v":3},{"$f":"K9+1","v":4},{"$f":"L9+1","v":5},"Unit definition","Unit Cost (Base Year)",{"$f":"StartYear","v":0},{"$f":"P9+1","v":1},{"$f":"Q9+1","v":2},{"$f":"R9+1","v":3},{"$f":"S9+1","v":4},{"$f":"T9+1","v":5},{"$f":"StartYear","v":0},{"$f":"V9+1","v":1},{"$f":"W9+1","v":2},{"$f":"X9+1","v":3},{"$f":"Y9+1","v":4},{"$f":"Z9+1","v":5}]
[1,{"$f":"'1.4 Interventions'!C13","v":"Comprehensive HIV testing services - provider initiated"},"1. Accelerate prevention to reduce new HIV, TB and STI infections.","1.1.2 Implement targeted combination prevention services tailored to setting and population\n","Testing","Ingredients","Persons Tested",{"$f":"'3.2 Population Indicators'!D14","v":4000000},{"$f":"'3.2 Population Indicators'!E14","v":4000000},{"$f":"'3.2 Population Indicators'!F14","v":4000000},{"$f":"'3.2 Population Indicators'!G14","v":4000000},{"$f":"'3.2 Population Indicators'!H14","v":4000000},{"$f":"'3.2 Population Indicators'!I14","v":6000000},{"$f":"'3.1 Unit Cost Table'!B10","v":"Average cost per person tested for HIV - PICT"},{"$f":"'3.1 Unit Cost Table'!E10","v":110.66155579328506},{"$f":"'3.1 Unit Cost Table'!G10","v":110.66155579328506},{"$f":"'3.1 Unit Cost Table'!H10","v":110.66155579328506},{"$f":"'3.1 Unit Cost Table'!I10","v":110.66155579328506},{"$f":"'3.1 Unit Cost Table'!J10","v":110.66155579328506},{"$f":"'3.1 Unit Cost Table'!K10","v":110.66155579328506},{"$f":"'3.1 Unit Cost Table'!L10","v":110.66155579328506},{"$f":"H10*P10","v":442646223.17314023},{"$f":"I10*Q10","v":442646223.17314023},442646223.17314023,442646223.17314023,442646223.17314023,663969334.75971031]
{"$rows_left_out":100}
{"sheet":"4.1 Efficiency","index":16,"n_rows":26,"n_cols":7,"rows_kept":26,"cut":false,"hidden":false,"merged":[[16,1,16,3],[27,1,27,2],[28,1,28,2],[22,1,22,2],[23,1,23,2],[24,1,24,2],[25,1,25,2],[26,1,26,2],[19,6,24,6],[17,1,17,2],[18,1,18,2],[20,1,20,2],[21,1,21,2]]}
[]
[]
[null,"CHAPTER 10: FURTHER ANALYSIS"]
[]
[null,"Efficiency"]
[]
[]
[]
["Step 1: indentify inefficiencies and solutions"]
["Step 2: identify that top 3 to 5 that can likely lead to the greatest efficiency gains.  "]
{"$rows_left_out":17}
{"sheet":"4.2 SA","index":17,"n_rows":85,"n_cols":15,"rows_kept":85,"cut":false,"hidden":false,"merged":[[14,8,18,10],[51,0,51,9]]}
[]
[]
[null,"CHAPTER 10: FURTHER ANALYSIS"]
[]
[null,"Sensitivity analysis"]
[]
[]
["Step 1: identify key variables with uncertaintly: enter them into column C.  "]
["Step 2: name the cells for use in the analysis in column G"]
[]
{"$rows_left_out":76}
{"sheet":"4.2 Scenario Analysis","index":18,"n_rows":1,"n_cols":1,"rows_kept":1,"cut":false,"hidden":true,"merged":[]}
["Fern"]

{"sheet":"4.4 Equity Analysis","index":19,"n_rows":1,"n_cols":1,"rows_kept":1,"cut":false,"hidden":true,"merged":[]}
["Fern"]

{"sheet":"5.1 TRAC","index":20,"n_rows":11,"n_cols":25,"rows_kept":11,"cut":false,"hidden":false,"merged":[[5,24,6,24],[5,0,5,4],[5,5,5,9],[5,10,5,15],[5,16,5,23]]}
[]
[]
[null,"CHAPTER 11: TRANSPARENT REPORTING AND ANALYSIS FOR COSTINGS (TRAC)"]
[null,"Instructions: Please complete this table as part of final submission for review. "]
[]
["NSP Alignment",null,null,null,null,"REPORTING COST ESTIMATE",null,null,null,null,"COST ESTIMATION TYPE & SOURCES",null,null,null,null,null,"DETAILS ON INGREDIENTS AND ADAPTATIONS",null,null,null,null,null,null,null,"Other Comments"]
["Intervention","Target Populations","Activities","Provider-led or community-led","Included in Costing?","Cost component","Estimated Cost Value ","currency","currency year","Output Unit","Method for Estimation","Primary Source(s)","Source Type","Modeled/Observed","Financial/Economic","Full/Incremental","Service-level human resources","Service-level overhead costs","Above service-level (indirect) costs?","Supplies","Adjusted for historical inflation?","Adapted cost for specific ingredients?","Other adaptations (scale, output, other)?","Assumptions or notes"]
["List every intervention listed in the planning document","Specify population the intervention seeks to target. \n\nN/A for program support or other interventions. ","Specify activities that make up each intervention ","Is this a community led resposed (CLR) driven and delivered by affected communities,  or by health or other professional providers ? ","Ta","Specify which input or activity cost is being reported in this row, e.g. drug costs or staff costs, or post-test counselling. If it is the full cost, enter Full","Insert final  cost(s) value used. ","specify currency "," currency reporting year","per measure of output (example: per person tested) ","Unit cost adapted from literature (adapatation approach), Unit cost modeled from ingredient based costing (IBC), Lump Sum or % of direct costs.","Identify primary source(s) used. If published source: input study author, year, and DOI. If unpublished documents (grey literature): input title, year, author, if available website, data accessed. If Key informant: specify role and institution, date discussed. ","Specify source type: Peer-reviewed study, Expenditure report, Budget,  Key Informant Interview,  Country modeled costing, NASA report. If other, specify. ","Was this unit costs modelled based on how the intervention should work or valued based on observed implementation? ","Is this cost financial (an expenditure) or economic (includes values for donated goods and services)? ","Does this include only the extra costs to add it on to existing services (Incremental) or include the full cost of all activities needed to run the intervention including a shared costs(Full)","Does this estimate include cost of human resources needed to administer intervention or are they accounted for elsewhere? If so specify where in assumptions. If excluded, justify.","Does this estimate include service-level overhead costs or are they accounted for elsewhere? If so specify where in assumptions. If excluded, justify.","Does this estimate include above-service-level (or indirect) costs or are they accounted for elsewhere? If so specify where in assumptions. If excluded, justify.","Does this estimate include cost of supplies or are they accounted for elsewhere? If so specify where in assumptions. If excluded, justify.","Was this estimate adjusted for historical inflation? If Not, justify. ","Was this estimate adapted for differing ingredients or costs?","Where other adaptations made? If yes, specify in assumptions or notes. ","Specify what assumptions were made and data manipulations applied for estimate. ","Provide justifications, or any other comments here. "]
["examples:"]
["VMMC","Men","Facility-based VMMC service including client assessment and counseling and VMMC itself. ","No","Yes","VMMC surgery",25.19,"USD",2023,"per person circumcised","Adapt existing unit cost","Hewett, 2016 https://doi.org/10.1186/s12889-016-3450-x","Published peer-reviewed","Observed","Financial","Full","yes","yes","Yes","Yes","yes","no"]
{"$rows_left_out":2}
{"sheet":"5.2 Results Summary","index":21,"n_rows":31,"n_cols":20,"rows_kept":31,"cut":false,"hidden":false,"merged":[]}
[]
[]
[null,"CHAPTER 11: PACKAGING THE COST ANALYSIS FOR USE"]
[]
[null,"Presenting intuitive figures and graphs"]
[]
[]
[]
[]
[]
{"$rows_left_out":21}